{"text_format":"1","workbook":"xlsx","n_sheets":5,"sheets":["BLS Roste","BLS Lüftungsquerschnitt","KS-LS Roste","KS-LS Lüftungsquerschnitt","Start"],"not_rendered":{"charts":0,"images":6,"macros":1,"external_links":0,"defined_names":9,"comments":2,"pivot_tables":0},"unopened":[],"bounds":{"document_bytes":16777216,"sheet_cells":100000,"rows_first":2000,"rows_last":500,"rows_between":2000,"halvings":0,"cell_chars":16384,"cell_head_chars":4096},"cells_cut":0,"cells_raw":0,"read":"whole","date_system":"1900"}

{"sheet":"BLS Roste","index":0,"n_rows":133,"n_cols":20,"rows_kept":133,"cut":false,"hidden":true,"merged":[[6,2,6,3],[6,4,6,5],[4,1,4,7],[132,1,132,7]]}
[]
[null,"Berechnungshilfe Lüftungsquerschnitte ACO Betonlichtschacht",null,null,null,null,"Datum:2024-01-17","Release:V1.5"]
[]
[null,"Disclaimer:"]
[null,"Die Berechnungshilfe „Lüftungsquerschnitte“ basiert auf dem aktuellen Stand der Wissenschaft und Technik. Die Nutzung befreit nicht von Planungs- und Sorgfaltspflichten, sondern setzt vielmehr angemessene, branchenübliche Sach- und Fachkunde voraus. Insbesondere sind objektbezogene Empfehlungen, technische Zeichnungen und Berechnungen weiterhin selbst zu verantworten sowie alle bauaufsichtlichen Voraussetzungen unter Berücksichtigung aller örtlichen Gegebenheiten, der technischen Regelwerke und des aktuellen Standes der Technik weiterhin selbst zu prüfen. Diese Aufzählung von Sorgfaltspflichten ist nicht abschließend. Die Berechnungshilfe ersetzt auch nicht die Prüfung durch Sonderfachleute. Es gelten die ACO GmbH- AGB https://www.aco.de/unternehmen/agb, unter besonderem Verweis auf § 10."]
[]
[null,null,"Für Lichtschacht",null,"Abmessungen"]
[null,"Artikel-Nr.","Lichte Tiefe","Lichte Breite","Tiefe","Breite","Rost","Lüftung"]
[null,null,"[mm]","[mm]","[mm]","[mm]",null,"[m²]",null,null,null,null,null,null,"Maschenrost 1020, MW 33x33, LKW 30",null,"Tiefe","Breite"]
[null,377221,500,820,520,900,"30/30, begehbar",0.35299999999999998,null,null,null,null,null,null,"Maschenrost 1020x500 H50, MW 33x33, LKW 30","380960",600,"1230","443,047.28",{"$f":"S10/1000000","v":0.44304728000000004}]
[null,377222,600,820,620,900,"30/30, begehbar",0.42799999999999999,null,"Bitte hier gewünschte Artikelnummer einkopieren:",null,null,null,null,"Maschenrost 1020x600 H60, MW 33x33, LKW 30","380961",700,"1230",546248.32999999996,{"$f":"S11/1000000","v":0.54624832999999995}]
[null,377223,500,1020,520,1100,"30/30, begehbar",0.44,null,null,null,null,null,null,"Maschenrost 1020x800 H80, MW 33x33, LKW 30","380962",900,"1230",717302.04,{"$f":"S12/1000000","v":0.71730204000000009}]
[null,377224,600,1020,620,1100,"30/30, begehbar",0.53300000000000003,null,"Artikel-Nr.",385036,null,null,null,"Maschenrost 1020x1000 H100, MW 33x33, LKW 30","385444",1100,"1230",888355.45,{"$f":"S13/1000000","v":0.88835544999999994}]
[null,377225,800,1020,820,1100,"30/30, begehbar",0.70599999999999996,null,"Lichtschacht"]
[null,377226,1000,1020,1020,1100,"30/30, begehbar",0.89400000000000002,null,"Lichte Tiefe",{"$f":"VLOOKUP($K$13,B:H,2,0)","v":800},null,null,null,"Maschenrost 1270, MW 33x33, LKW 30"]
[null,377227,500,1270,520,1350,"30/30, begehbar",0.54900000000000004,null,"Lichte Breite",{"$f":"VLOOKUP($K$13,B:H,3,0)","v":2520},null,null,null,"Maschenrost 1270x500 H50, MW 33x33, LKW 30","380902",600,1480,"489618.43",{"$f":"S16/1000000","v":0.48961842999999999}]
[null,377228,600,1270,620,1350,"30/30, begehbar",0.66400000000000003,null,"Rost",{"$f":"VLOOKUP($K$13,B:H,6,0)","v":"33/33, SLW 30, ohne HifüPla"},null,null,null,"Maschenrost 1270x600 H60, MW 33x33, LKW 30","380903",700,1480,"587973.88",{"$f":"S17/1000000","v":0.58797388000000006}]
[null,377229,800,1270,820,1350,"30/30, begehbar",0.879,null,"Tiefe",{"$f":"VLOOKUP($K$13,B:H,4,0)","v":900},null,null,null,"Maschenrost 1270x800 H80, MW 33x33, LKW 30","380904",900,1480,"785143.18",{"$f":"S18/1000000","v":0.78514318000000005}]
[null,377230,1000,1270,1020,1350,"30/30, begehbar",1.1120000000000001,null,"Breite",{"$f":"VLOOKUP($K$13,B:H,5,0)","v":"1363"},null,null,null,"Maschenrost 1270x1000 H100, MW 33x33, LKW 30","385448",1100,1480,"982965.36",{"$f":"S19/1000000","v":0.98296536000000001}]
[null,377231,500,1520,520,1600,"30/30, begehbar",0.65100000000000002]
[null,377232,600,1520,620,1600,"30/30, begehbar",0.78800000000000003,null,null,null,null,null,null,"Maschenrost 1520, MW 33x33, LKW 30"]
[null,377233,800,1520,820,1600,"30/30, begehbar",1.0429999999999999,null,"Lüftungsquerschnitt:",{"$f":"VLOOKUP($K$13,B:H,7,0)","v":1.647},null,null,null,"Maschenrost 1520x500 H50, MW 33x33, LKW 30","380905",600,865,"587947.5",{"$f":"S22/1000000","v":0.58794749999999996}]
[null,377234,1000,1520,1020,1600,"30/30, begehbar",1.319,null,null,null,null,null,null,"Maschenrost 1520x600 H60, MW 33x33, LKW 30","380906",700,865,"706042",{"$f":"S23/1000000","v":0.70604199999999995}]
[null,385359,500,1800,520,1880,"30/30, begehbar",0.78,null,null,null,null,null,null,"Maschenrost 1520x800 H80, MW 33x33, LKW 30","380907",900,865,"942911.84",{"$f":"S24/1000000","v":0.94291183999999995}]
[null,385360,600,1800,620,1880,"30/30, begehbar",0.94,null,null,null,null,null,null,"Maschenrost 1520x1000 H100, MW 33x33, LKW 30","385452",1100,865,"1180306.4",{"$f":"S25/1000000","v":1.1803063999999999}]
[null,385361,800,1800,820,1880,"30/30, begehbar",1.27]
[null,385362,1000,1800,1020,1880,"30/30, begehbar",1.59,null,null,null,null,null,null,"Maschenrost 1800, MW 33x33, LKW 30"]
[null,377235,500,2050,520,2130,"30/30, begehbar",0.88200000000000001,null,null,null,null,null,null,"Maschenrost 1800x500 H50, MW 33x33, LKW 30","385434",600,1003,"673268.72",{"$f":"S28/1000000","v":0.67326871999999993}]
[null,377236,600,2050,620,2130,"30/30, begehbar",1.0669999999999999,null,null,null,null,null,null,"Maschenrost 1800x600 H60, MW 33x33, LKW 30","385435",700,1003,"812667.48",{"$f":"S29/1000000","v":0.81266748}]
[null,377237,800,2050,820,2130,"30/30, begehbar",1.4119999999999999,null,null,null,null,null,null,"Maschenrost 1800x800 H80, MW 33x33, LKW 30","385436",900,1003,"1091602.82",{"$f":"S30/1000000","v":1.0916028200000001}]
[null,377238,1000,2050,1020,2130,"30/30, begehbar",1.784,null,null,null,null,null,null,"Maschenrost 1800x1000 H100, MW 33x33, LKW 30","385437",1100,1003,"1370414.04",{"$f":"S31/1000000","v":1.37041404}]
[null,377239,600,2520,620,2600,"30/30, begehbar",1.3149999999999999]
[null,377240,800,2520,820,2600,"30/30, begehbar",1.7390000000000001,null,null,null,null,null,null,"Maschenrost 2050, MW 33x33, LKW 30"]
[null,377241,1000,2520,1020,2600,"30/30, begehbar",2.1970000000000001,null,null,null,null,null,null,"Maschenrost 2050x500 H50, MW 33x33, LKW 30","380908",600,1128,"751301.02",{"$f":"S34/1000000","v":0.75130101999999999}]
[null,377242,500,820,520,900,"30/10, begehbar",0.32200000000000001,null,null,null,null,null,null,"Maschenrost 2050x600 H60, MW 33x33, LKW 30","380909",700,1128,"906635.9",{"$f":"S35/1000000","v":0.90663590000000005}]
[null,377243,600,820,620,900,"30/10, begehbar",0.39,null,null,null,null,null,null,"Maschenrost 2050x800 H80, MW 33x33, LKW 30","380910",900,1128,"1217733.02",{"$f":"S36/1000000","v":1.2177330200000001}]
[null,377244,500,1020,520,1100,"30/10, begehbar",0.40100000000000002,null,null,null,null,null,null,"Maschenrost 2050x1000 H100, MW 33x33, LKW 30","385456",1100,1128,"1529499.44",{"$f":"S37/1000000","v":1.5294994399999999}]
[null,377245,600,1020,620,1100,"30/10, begehbar",0.48499999999999999]
[null,377246,800,1020,820,1100,"30/10, begehbar",0.64400000000000002,null,null,null,null,null,null,"Maschenrost 2520, MW 33x33, LKW 30"]
[null,377247,1000,1020,1020,1100,"30/10, begehbar",0.81399999999999995,null,null,null,null,null,null,"Maschenrost 2520x600 H60, MW 33x33, LKW 30","385035",700,"1363","1,255,349.52",{"$f":"S40/1000000","v":1.25534952}]
[null,377248,500,1270,520,1350,"30/10, begehbar",0.5,null,null,null,null,null,null,"Maschenrost 2520x800 H80, MW 33x33, LKW 30","385036",900,"1363","1,647,039.2",{"$f":"S41/1000000","v":1.6470392}]
[null,377249,600,1270,620,1350,"30/10, begehbar",0.60499999999999998,null,null,null,null,null,null,"Maschenrost 2520x1000 H100, MW 33x33, LKW 30","385037",1100,"1363","2,059,159.62",{"$f":"S42/1000000","v":2.05915962}]
[null,377250,800,1270,820,1350,"30/10, begehbar",0.80100000000000005]
[null,377251,1000,1270,1020,1350,"30/10, begehbar",1.012]
[null,377252,500,1520,520,1600,"30/10, begehbar",0.59299999999999997]
[null,377253,600,1520,620,1600,"30/10, begehbar",0.71699999999999997,null,null,null,null,null,null,"Maschenrost 1020, MW 33x33, LKW 30 (mit Beton Hinterfuellplatte)"]
[null,377254,800,1520,820,1600,"30/10, begehbar",0.95,null,null,null,null,null,null,"Maschenrost 1020x500 H50, MW 33x33, LKW 30 (mit Beton Hinterfuellplatte)","380963",700,"1230","443,047.28",{"$f":"S47/1000000","v":0.44304728000000004}]
[null,377255,1000,1520,1020,1600,"30/10, begehbar",1.2,null,null,null,null,null,null,"Maschenrost 1020x600 H60, MW 33x33, LKW 30 (mit Beton Hinterfuellplatte)","380964",800,"1230","546,248.33",{"$f":"S48/1000000","v":0.54624832999999995}]
[null,385363,500,1800,520,1880,"30/10, begehbar",0.71,null,null,null,null,null,null,"Maschenrost 1020x800 H80, MW 33x33, LKW 30 (mit Beton Hinterfuellplatte)","380965",1000,"1230","717,302.04",{"$f":"S49/1000000","v":0.71730204000000009}]
[null,385364,600,1800,620,1880,"30/10, begehbar",0.85,null,null,null,null,null,null,"Maschenrost 1020x1000 H100, MW 33x33, LKW 30 (mit Beton Hinterfuellplatte)","385445",1200,"1230","888,355.45",{"$f":"S50/1000000","v":0.88835544999999994}]
[null,385365,800,1800,820,1880,"30/10, begehbar",1.1499999999999999]
[null,385366,1000,1800,1020,1880,"30/10, begehbar",1.45,null,null,null,null,null,null,"Maschenrost 1270, MW 33x33, LKW 30 (mit Beton Hinterfuellplatte)"]
[null,377256,500,2050,520,2130,"30/10, begehbar",0.80300000000000005,null,null,null,null,null,null,"Maschenrost 1270x500 H50, MW 33x33, LKW 30 (mit Beton Hinterfuellplatte)","380911",700,1480,"489618.43",{"$f":"S53/1000000","v":0.48961842999999999}]
[null,377257,600,2050,620,2130,"30/10, begehbar",0.97099999999999997,null,null,null,null,null,null,"Maschenrost 1270x600 H60, MW 33x33, LKW 30 (mit Beton Hinterfuellplatte)","380912",800,1480,"587973.88",{"$f":"S54/1000000","v":0.58797388000000006}]
[null,377258,800,2050,820,2130,"30/10, begehbar",1.286,null,null,null,null,null,null,"Maschenrost 1270x800 H80, MW 33x33, LKW 30 (mit Beton Hinterfuellplatte)","380913",1000,1480,"785143.18",{"$f":"S55/1000000","v":0.78514318000000005}]
[null,377259,1000,2050,1020,2130,"30/10, begehbar",1.6240000000000001,null,null,null,null,null,null,"Maschenrost 1270x1000 H100, MW 33x33, LKW 30 (mit Beton Hinterfuellplatte)","385449",1200,1480,"982965.36",{"$f":"S56/1000000","v":0.98296536000000001}]
[null,377260,600,2520,620,2600,"30/10, begehbar",1.196]
[null,377261,800,2520,820,2600,"30/10, begehbar",1.5840000000000001,null,null,null,null,null,null,"Maschenrost 1520, MW 33x33, LKW 30 (mit Beton Hinterfuellplatte)"]
[null,377262,1000,2520,1020,2600,"30/10, begehbar",2,null,null,null,null,null,null,"Maschenrost 1520x500 H50, MW 33x33, LKW 30 (mit Beton Hinterfuellplatte)","380914",700,865,"587947.5",{"$f":"S59/1000000","v":0.58794749999999996}]
[null,377263,500,820,520,900,"30/10, befahrbar",0.29199999999999998,null,null,null,null,null,null,"Maschenrost 1520x600 H60, MW 33x33, LKW 30 (mit Beton Hinterfuellplatte)","380915",800,865,"706042",{"$f":"S60/1000000","v":0.70604199999999995}]
{"$rows_left_out":74}
{"sheet":"BLS Lüftungsquerschnitt","index":1,"n_rows":49,"n_cols":8,"rows_kept":49,"cut":false,"hidden":true,"merged":[[5,1,5,7],[9,2,9,3],[34,6,35,6],[39,6,40,6],[35,7,36,7],[7,2,7,3],[14,2,14,3],[9,5,9,6]]}
[]
[null,"Berechnungshilfe Lüftungsquerschnitte ACO Betonlichtschacht",null,null,null,null,"Datum:2024-01-17","Release:V1.5"]
[]
[null," Reduzierte Lüftungsquerschnitte bei verkürzten Rosten | Beton-Lichtschacht"]
[null,"Disclaimer"]
[null,"Die Berechnungshilfe „Lüftungsquerschnitte“ basiert auf dem aktuellen Stand der Wissenschaft und Technik. Die Nutzung befreit nicht von Planungs- und Sorgfaltspflichten, sondern setzt vielmehr angemessene, branchenübliche Sach- und Fachkunde voraus. Insbesondere sind objektbezogene Empfehlungen, technische Zeichnungen und Berechnungen weiterhin selbst zu verantworten sowie alle bauaufsichtlichen Voraussetzungen unter Berücksichtigung aller örtlichen Gegebenheiten, der technischen Regelwerke und des aktuellen Standes der Technik weiterhin selbst zu prüfen. Diese Aufzählung von Sorgfaltspflichten ist nicht abschließend. Die Berechnungshilfe ersetzt auch nicht die Prüfung durch Sonderfachleute. Es gelten die ACO GmbH- AGB https://www.aco.de/unternehmen/agb, unter besonderem Verweis auf § 10."]
[]
[null," gewählter Rost","Artikel-Nr.",null,null,{"$f":"'BLS Roste'!K13","v":385036}]
[]
[null," Lichtschachtmaße"]
[null,"Lichte Breite",{"$f":"'BLS Roste'!K16","v":2520},"mm"]
[null,"Lichte Tiefe",{"$f":"'BLS Roste'!K15","v":800},"mm"]
[]
[null," Rost - Standard"]
[null,"Ausführung",{"$f":"'BLS Roste'!K17","v":"33/33, SLW 30, ohne HifüPla"}]
[null,"Breite (Außenmaß)",{"$f":"'BLS Roste'!K19","v":"1363"},"mm"]
[null,"Tiefe (Außenmaß)",{"$f":"'BLS Roste'!K18","v":900},"mm"]
[null,"Rostgröße",{"$f":"$C$16*$C$17*0.000001","v":1.2266999999999999},"m²"]
[]
[null," nutzbarer Lüftungsquerschnitt",{"$f":"'BLS Roste'!K22","v":1.647},"m²",null," (lt. Zeichnung)"]
[]
[null," Rost - verkürzt"]
[null,"Verkürzung",200,"mm"]
[null,"verkürzte Rosttiefe",{"$f":"$C$17-$C$23","v":700},"mm",null,"(neues Außenmaß)"]
[null,"Abzugsfläche  ",{"$f":"$C$20/$C$12*$C$23","v":0.41174999999999995},"m²"]
[]
[null," neuer Lüftungsquerschnitt",{"$f":"$C$20-$C$25","v":1.2352500000000002},"m²"]
[]
[null,"Zur Berechnung der Fläche wird die originale Tiefe zur neuen Tiefe ins Verhältnis gesetzt."]
[null,"Rostschema"]
[]
[]
[]
[]
[null,null,null,null,null,null,{"$f":"$C$24","v":700}]
[null,null,null,null,null,null,null,{"$f":"$C$17","v":900}]
[]
[]
[]
[null,null,null,null,null,null,{"$f":"$C$23","v":200}]
[]
[null,null,{"$f":"$C$11","v":2520}]
[]
[null,"Klicken Sie den untenstehenden Link um direkt zum gewählten Artikel zu gelangen:"]
[null,{"$f":"HYPERLINK(\"https://www.aco.de/suche?tx_solr%5Bq%5D=\"&$F$8)","v":"https://www.aco.de/suche?tx_solr%5Bq%5D=385036"}]
[]
[null,"Zu unseren Rosten für Betonlichtschächte"]
[]
[null,"Zu unseren Betonlichtschächten"]

{"sheet":"KS-LS Roste","index":2,"n_rows":93,"n_cols":11,"rows_kept":93,"cut":false,"hidden":true,"merged":[[4,1,4,7],[6,2,6,3],[6,4,6,5],[5,42,5,43]]}
[]
[null,"Berechnungshilfe Lüftungsquerschnitte ACO Kunststofflichtschacht",null,null,null,null,"Datum:2024-01-17","Release:V1.5"]
[]
[null,"Disclaimer:"]
[null,"Die Berechnungshilfe „Lüftungsquerschnitte“ basiert auf dem aktuellen Stand der Wissenschaft und Technik. Die Nutzung befreit nicht von Planungs- und Sorgfaltspflichten, sondern setzt vielmehr angemessene, branchenübliche Sach- und Fachkunde voraus. Insbesondere sind objektbezogene Empfehlungen, technische Zeichnungen und Berechnungen weiterhin selbst zu verantworten sowie alle bauaufsichtlichen Voraussetzungen unter Berücksichtigung aller örtlichen Gegebenheiten, der technischen Regelwerke und des aktuellen Standes der Technik weiterhin selbst zu prüfen. Diese Aufzählung von Sorgfaltspflichten ist nicht abschließend. Die Berechnungshilfe ersetzt auch nicht die Prüfung durch Sonderfachleute. Es gelten die ACO GmbH- AGB https://www.aco.de/unternehmen/agb, unter besonderem Verweis auf § 10."]
[]
[null,null,"Für Lichtschacht",null,"Abmessungen"]
[null,"Artikel-Nr.","Lichte Tiefe","Lichte Breite","Tiefe","Breite","Rost","Lüftung"]
[null,null,"[mm]","[mm]","[mm]","[mm]",null,"[m²]"]
[null,35572,400,800,400,840,"Streckmetall",0.221]
[null,35573,400,1000,400,1040,"Streckmetall",0.29699999999999999,null,"Bitte hier gewünschte Artikelnummer einkopieren:"]
[null,"35573*",400,1000,400,1040,"Streckmetall",0.28599999999999998]
[null,35896,400,1250,400,1340,"Streckmetall",0.39200000000000002,null,"Artikel-Nr.",10478]
[null,38767,700,1500,700,1665,"Streckmetall",0.84399999999999997,null,"Lichtschacht"]
[null,38770,700,2000,700,2165,"Streckmetall",1.113,null,"Lichte Tiefe",{"$f":"VLOOKUP($K$13,B:H,2,0)","v":400}]
[null,315870,600,1000,600,1040,"Streckmetall",0.46200000000000002,null,"Lichte Breite",{"$f":"VLOOKUP($K$13,B:H,3,0)","v":1000}]
[null,315874,600,1250,600,1340,"Streckmetall",0.60199999999999998,null,"Rost",{"$f":"VLOOKUP($K$13,B:H,6,0)","v":"Streckmetall vk."}]
[null,375096,400,1000,424,1040,"Streckmetall",0.28499999999999998,"4-seit.","Tiefe",{"$f":"VLOOKUP($K$13,B:H,4,0)","v":250}]
[null,375097,400,1250,424,1340,"Streckmetall",0.375,"4-seit.","Breite",{"$f":"VLOOKUP($K$13,B:H,5,0)","v":1040}]
[null,375098,600,1000,625,1040,"Streckmetall",0.44500000000000001,"4-seit."]
[null,375099,600,1250,625,1340,"Streckmetall",0.58599999999999997,"4-seit."]
[null,null,null,null,null,null,null,null,null,"Lüftungsquerschnitt:",{"$f":"VLOOKUP($K$13,B:H,7,0)","v":0.17499999999999999}]
[]
[]
[null,10476,400,1000,350,1040,"Streckmetall vk.",0.25600000000000001]
[null,10477,400,1000,300,1040,"Streckmetall vk.",0.215]
[null,10478,400,1000,250,1040,"Streckmetall vk.",0.17499999999999999]
[null,10479,400,1250,300,1340,"Streckmetall vk.",0.28499999999999998]
[null,10480,400,1250,250,1340,"Streckmetall vk.",0.23200000000000001]
[null,315867,600,1000,450,1040,"Streckmetall vk.",0.33900000000000002]
[null,315868,600,1000,500,1040,"Streckmetall vk.",0.38]
[null,315869,600,1000,550,1040,"Streckmetall vk.",0.42099999999999999]
[null,315871,600,1250,450,1340,"Streckmetall vk.",0.442]
[null,315872,600,1250,500,1340,"Streckmetall vk.",0.495]
[null,315873,600,1250,550,1340,"Streckmetall vk.",0.54900000000000004]
[null,"Divers0",400,1250,350,1340,"Streckmetall vk.",0.33800000000000002]
[]
[]
[null,35574,400,800,400,840,"30/30",0.24199999999999999]
[null,35575,400,1000,400,1040,"30/30",0.32600000000000001]
[null,35576,400,800,400,840,"30/10",0.218]
[null,35577,400,1000,400,1040,"30/10",0.29399999999999998]
[null,35578,400,800,400,840,"befahrbar",0.19500000000000001]
[null,35579,400,1000,400,1040,"befahrbar",0.26200000000000001]
[null,35897,400,1250,400,1340,"30/30",0.42899999999999999]
[null,35898,400,1250,400,1340,"30/10",0.38700000000000001]
[null,35899,400,1250,400,1340,"befahrbar",0.34499999999999997]
[null,38768,700,1500,700,1665,"30/30",0.93300000000000005]
[null,38769,700,1500,700,1665,"30/10",0.84399999999999997]
[null,38771,700,2000,700,2165,"30/30",1.23]
[null,38772,700,2000,700,2165,"30/10",1.111]
[null,315878,600,1000,600,1040,"30/30",0.50600000000000001]
[null,315882,600,1250,600,1340,"30/30",0.65900000000000003]
[null,315999,600,1000,600,1040,"30/10",0.45900000000000002]
[null,375028,600,1250,600,1340,"30/10",0.59399999999999997]
[null,375029,600,1000,600,1040,"befahrbar",0.41099999999999998]
[null,375030,600,1250,600,1340,"befahrbar",0.53200000000000003]
[null,375102,400,1000,424,1040,"30/30",0.30599999999999999,"4-seit."]
[null,375103,400,1250,424,1340,"30/30",0.41099999999999998,"4-seit."]
[null,375104,600,1000,625,1040,"30/30",0.49,"4-seit."]
{"$rows_left_out":34}
{"sheet":"KS-LS Lüftungsquerschnitt","index":3,"n_rows":59,"n_cols":19,"rows_kept":59,"cut":false,"hidden":true,"merged":[[39,6,40,6],[5,1,5,7],[7,2,7,3],[9,2,9,3],[9,5,9,6],[14,2,14,3],[34,6,35,6],[35,7,36,7]]}
[]
[null,"Berechnungshilfe Lüftungsquerschnitte ACO Betonlichtschacht",null,null,null,null,"Datum:2024-01-17","Release:V1.5"]
[]
[null," Reduzierte Lüftungsquerschnitte bei verkürzten Rosten | Kunststoff-Lichtschacht"]
[null,"Disclaimer"]
[null,"Die Berechnungshilfe „Lüftungsquerschnitte“ basiert auf dem aktuellen Stand der Wissenschaft und Technik. Die Nutzung befreit nicht von Planungs- und Sorgfaltspflichten, sondern setzt vielmehr angemessene, branchenübliche Sach- und Fachkunde voraus. Insbesondere sind objektbezogene Empfehlungen, technische Zeichnungen und Berechnungen weiterhin selbst zu verantworten sowie alle bauaufsichtlichen Voraussetzungen unter Berücksichtigung aller örtlichen Gegebenheiten, der technischen Regelwerke und des aktuellen Standes der Technik weiterhin selbst zu prüfen. Diese Aufzählung von Sorgfaltspflichten ist nicht abschließend. Die Berechnungshilfe ersetzt auch nicht die Prüfung durch Sonderfachleute. Es gelten die ACO GmbH- AGB https://www.aco.de/unternehmen/agb, unter besonderem Verweis auf § 10."]
[]
[null," gewählter Rost","Artikel-Nr.",null,null,{"$f":"'KS-LS Roste'!$K$13","v":10478}]
[]
[null," Lichtschachtmaße"]
[null,"Lichte Breite",{"$f":"'KS-LS Roste'!K16","v":1000},"mm"]
[null,"Lichte Tiefe",{"$f":"'KS-LS Roste'!K15","v":400},"mm"]
[]
[null," Rost "]
[null,"Ausführung",{"$f":"VLOOKUP($F$8,'KS-LS Roste'!B10:H94,6,0)","v":"Streckmetall vk."}]
[null,"Breite (Außenmaß)",{"$f":"VLOOKUP($F$8,'KS-LS Roste'!B10:H94,5,0)","v":1040},"mm"]
[null,"Tiefe (Außenmaß)",{"$f":"VLOOKUP($F$8,'KS-LS Roste'!B10:H94,4,0)","v":250},"mm"]
[null,"Rostgröße",{"$f":"$C$16*$C$17*0.000001","v":0.26},"m²"]
[]
[null," nutzbarer Lüftungsquerschnitt",{"$f":"'KS-LS Roste'!K22","v":0.17499999999999999},"m²",null," (lt. Zeichnung)"]
[]
[null," Rost - verkürzt"]
[null,"Verkürzung",400,"mm"]
[null,"verkürzte Rosttiefe",{"$f":"$C$17-$C$23","v":-150},"mm",null,"(neues Außenmaß)"]
[null,"Abzugsfläche  ",{"$f":"$C$20/$C$12*$C$23","v":0.17499999999999999},"m²"]
[]
[null," neuer Lüftungsquerschnitt",{"$f":"$C$20-$C$25","v":0},"m²"]
[]
[null,"Zur Berechnung der Fläche wird die originale Tiefe zur neuen Tiefe ins Verhältnis gesetzt."]
[null,"Rostschema"]
[]
[]
[]
[]
[null,null,null,null,null,null,{"$f":"$C$24","v":-150}]
[null,null,null,null,null,null,null,{"$f":"$C$17","v":250}]
[null,null,null,null,null,null,null,null,null,null,null,null,null,null,null,null,null,{"$f":"HYPERLINK(R45)","v":""}]
[]
[]
[null,null,null,null,null,null,{"$f":"$C$23","v":400}]
[]
[null,null,{"$f":"$C$11","v":1000}]
[]
[]
[]
[]
[]
[null,"Klicken Sie den untenstehenden Link um direkt zum gewählten Artikel zu gelangen:"]
[null,{"$f":"HYPERLINK(\"https://www.aco.de/suche?tx_solr%5Bq%5D=\"&$F$8)","v":"https://www.aco.de/suche?tx_solr%5Bq%5D=10478"}]
[null,null,null,null,null,null,null,null,null,null,null,null,null,null,null,null,null,null,{"$f":"\"\"","v":""}]
[null,"Zu unseren Rosten für Kunststofflichtschächte"]
[]
[null,"Zu unseren Kunststofflichschächten"]
[]
[]
[null,null,null,null,null,null,null,null,null,null,null,null,null,null,null,null,null,{"$f":"$R$35","v":0}]
[]
[]
[null,null,null,null,null,null,null,null,null,null,null,null,null,null,null,null,null,{"$f":"HYPERLINK(R67)","v":""}]

{"sheet":"Start","index":4,"n_rows":1,"n_cols":1,"rows_kept":1,"cut":false,"hidden":false,"merged":[]}
["Bitte aktivieren Sie Makros zum Start."]